Sample OpenHatch event

Showing 6 bugs
Expand all Collapse all
  • No Project
    Assigned to
    No one
    Mentored by
    No one More about this bug
    ·

    I am a friendly little penguin

    No time at all! unclaimed
  • No Project
    Assigned to
    No one
    Mentored by
    No one More about this bug
    ·

    Enter a description of this task here

    No time at all! unclaimed
  • No Project
    Assigned to
    No one
    Mentored by
    No one More about this bug
    ·

    Enter a description of this task here

    No time at all! unclaimed
  • Python
    Assigned to
    me
    Mentored by
    No one More about this bug
    ·

    http://docs.python.org/3/library/unittest.html#unittest.TestCase.setUp "any exception raised by this method will be considered an error rather than a test failure" http://docs.python.org/3/library/unittest.html#unittest.TestCase.tearDown "Any exception raised by this method will be considered an error rather than a test failure." utest.py #!/usr/bin/env python3 import unittest class Test(unittest.TestCase): def setUp(self): raise AssertionError def tearDown(self): raise AssertionError def test_nothing(self): pass [guest@localhost py]$ python3 -m unittest -v utest test_nothing (utest.Test) ... FAIL ====================================================================== FAIL: test_nothing (utest.Test) ---------------------------------------------------------------------- Traceback (most recent call last): File "./utest.py", line 8, in setUp raise AssertionError AssertionError ---------------------------------------------------------------------- Ran 1 test in 0.000s FAILED (failures=1) [guest@localhost py]$ also raising unittest.SkipTest works properly

    No time at all! unclaimed
  • No Project
    Assigned to
    No one
    Mentored by
    No one More about this bug
    ·

    Enter a description of this task here

    No time at all! unclaimed
  • No Project
    Assigned to
    Me!
    Mentored by
    Asheesh More about this bug
    ·

    Testing

    No time at all! claimed